﻿"Dublin Core:Title","Dublin Core:Alternative Title","Dublin Core:Description","Dublin Core:Abstract","Dublin Core:Table Of Contents","Dublin Core:Bibliographic Citation","Dublin Core:Creator","Dublin Core:Contributor","Dublin Core:Date","Dublin Core:Date Created","Dublin Core:Date Available","Dublin Core:Date Accepted","Dublin Core:Date Copyrighted","Dublin Core:Date Submitted","Dublin Core:Date Modified","Dublin Core:Date Valid","Dublin Core:Date Issued","Dublin Core:Subject","Dublin Core:Coverage","Dublin Core:Spatial Coverage","Dublin Core:Temporal Coverage","Dublin Core:Language","Dublin Core:Type","Dublin Core:Format","Dublin Core:Extent","Dublin Core:Medium","Dublin Core:Identifier","Dublin Core:Relation","Dublin Core:Has Part","Dublin Core:Is Part Of","Dublin Core:Has Version","Dublin Core:Is Version Of","Dublin Core:Replaces","Dublin Core:Is Replaced By","Dublin Core:References","Dublin Core:Is Referenced By","Dublin Core:Has Format","Dublin Core:Is Format Of","Dublin Core:Requires","Dublin Core:Is Required By","Dublin Core:Conforms To","Dublin Core:Source","Dublin Core:Provenance","Dublin Core:Rights","Dublin Core:Rights Holder","Dublin Core:Access Rights","Dublin Core:License","Dublin Core:Publisher","Dublin Core:Accrual Method","Dublin Core:Accrual Periodicity","Dublin Core:Accrual Policy","Dublin Core:Audience","Dublin Core:Audience Education Level","Dublin Core:Mediator","Dublin Core:Instructional Method","Item Type Metadata:Text","Item Type Metadata:Interviewer","Item Type Metadata:Interviewee","Item Type Metadata:Location","Item Type Metadata:Transcription","Item Type Metadata:Local URL","Item Type Metadata:Original Format","Item Type Metadata:Physical Dimensions","Item Type Metadata:Duration","Item Type Metadata:Compression","Item Type Metadata:Producer","Item Type Metadata:Director","Item Type Metadata:Bit Rate/Frequency","Item Type Metadata:Time Summary","Item Type Metadata:Email Body","Item Type Metadata:Subject Line","Item Type Metadata:From","Item Type Metadata:To","Item Type Metadata:CC","Item Type Metadata:BCC","Item Type Metadata:Number of Attachments","Item Type Metadata:Standards","Item Type Metadata:Objectives","Item Type Metadata:Materials","Item Type Metadata:Lesson Plan Text","Item Type Metadata:URL","Item Type Metadata:Event Type","Item Type Metadata:Participants","Item Type Metadata:Birth Date","Item Type Metadata:Birthplace","Item Type Metadata:Death Date","Item Type Metadata:Occupation","Item Type Metadata:Biographical Text","Item Type Metadata:Bibliography","Item Type Metadata:Episode","Item Type Metadata:Season","Item Type Metadata:Episode Type","Item Type Metadata:Explicit","Item Type Metadata:Block","PDF Text:Text",Scripto:Transcription,tags,file,itemType,collection,public,featured
"A. A. Rogers",,,,,,"Von Seutter, E.",,1874,,,,,,,,,"<a href=""http://msstate-exhibits.libraryhost.com/exhibits/show/legislators/a--a--rogers--marshall-county-""><span style=""font-weight:400;"">Rogers, A. A., active 1874-1875</span></a>",,,,,,,,,,,,,,,,,,,,,,,,"<a href=""http://www.loc.gov/pictures/item/2006687066/"" target=""_blank"" rel=""noreferrer noopener"">Members of the Legislature, State of Mississippi, 1874-1875</a>",,,,,,,,,,,,,,,,,,,,,,,,,,,,,,,,,,,,,,,,,,,,,,,,,,,,,,,"legislators,rogers",https://msstate-exhibits.libraryhost.com/files/original/2f4d7feee73417d19aa540f703787265.png,"Still Image","Against All Odds: The First Black Legislators in Mississippi ",1,0
"Against All Odds header",,,,,,"Von Seutter, E.",,1874,,,,,,,,,,,,,,,,,,,,,,,,,,,,,,,,,,,,,,,,,,,,,,,,,,,,,,,,,,,,,,,,,,,,,,,,,,,,,,,,,,,,,,,,,https://msstate-exhibits.libraryhost.com/files/original/dc0c285511674f99a5d240df933bd3b1.jpg,"Still Image","Against All Odds: The First Black Legislators in Mississippi ",1,0
"Albert B. Poston",,,,,,"Von Seutter, E.",,1882,,,,,,,,,"<a href=""http://msstate-exhibits.libraryhost.com/exhibits/show/legislators/albert-b--poston--panola-count"">Poston, Albert B., 1855-1902</a>",,,,,,,,,,,,,,,,,,,,,,,,"<a href=""https://da.mdah.ms.gov/series/photos/detail/532827"" target=""_blank"" rel=""noreferrer noopener"">Legislature of Mississippi, 1882</a>",,,,,,,,,,,,,,,,,,,,,,,,,,,,,,,,,,,,,,,,,,,,,,,,,,,,,,,"legislators,poston",https://msstate-exhibits.libraryhost.com/files/original/cc164c0a2fbcca0301b85644f01bf4cf.PNG,"Still Image","Against All Odds: The First Black Legislators in Mississippi ",1,0
"Alexander Kelso Davis",,,,,,"Von Seutter, E.",,1874,,,,,,,,,"<a href=""http://msstate-exhibits.libraryhost.com/exhibits/show/legislators/alexander-kelso-davis--noxubee""><span style=""font-weight:400;"">Davis, A. K. (Alexander Kelso), -1884</span></a>",,,,,,,,,,,,,,,,,,,,,,,,"<a href=""http://www.loc.gov/pictures/item/2006687066/"" target=""_blank"" rel=""noreferrer noopener"">Members of the Legislature, State of Mississippi, 1874-1875</a>",,,,,,,,,,,,,,,,,,,,,,,,,,,,,,,,,,,,,,,,,,,,,,,,,,,,,,,"ak davis,legislators",https://msstate-exhibits.libraryhost.com/files/original/7a4da644eb87d381721f3d0f54a631b2.png,"Still Image","Against All Odds: The First Black Legislators in Mississippi ",1,0
"Alfred Fields",,,,,,"Von Seutter, E.",,1880,,,,,,,,,"<a href=""http://msstate-exhibits.libraryhost.com/exhibits/show/legislators/alfred-fields--panola-county-"">Fields, Alfred</a>",,,,,,,,,,,,,,,,,,,,,,,,"<a href=""https://da.mdah.ms.gov/series/photos/detail/532826"" target=""_blank"" rel=""noreferrer noopener"">Legislature of Mississippi, 1880</a>",,,,,,,,,,,,,,,,,,,,,,,,,,,,,,,,,,,,,,,,,,,,,,,,,,,,,,,"fields,legislators",https://msstate-exhibits.libraryhost.com/files/original/898024a6e3574032e456a1a10770da08.PNG,"Still Image","Against All Odds: The First Black Legislators in Mississippi ",1,0
"Alfred Newton Handy",,,,,,"Von Seutter, E.",,1874,,,,,,,,,"<a href=""http://msstate-exhibits.libraryhost.com/exhibits/show/legislators/alfred-newton-handy--madison-c""><span style=""font-weight:400;"">Handy, Alfred Newton, -1913</span></a>",,,,,,,,,,,,,,,,,,,,,,,,"<a href=""http://www.loc.gov/pictures/item/2006687066/"" target=""_blank"" rel=""noreferrer noopener"">Members of the Legislature, State of Mississippi, 1874-1875</a>",,,,,,,,,,,,,,,,,,,,,,,,,,,,,,,,,,,,,,,,,,,,,,,,,,,,,,,"alfred handy,legislators",https://msstate-exhibits.libraryhost.com/files/original/0a2d34e6de7985115fd46ae4b4f63a11.png,"Still Image","Against All Odds: The First Black Legislators in Mississippi ",1,0
"Alfred Peal",,,,,,"Von Seutter, E.",,1874,,,,,,,,,"<a href=""http://msstate-exhibits.libraryhost.com/exhibits/show/legislators/alfred-peal--marshall-county-"">Peal, Alfred, active 1874-1875</a>",,,,,,,,,,,,,,,,,,,,,,,,"<a href=""http://www.loc.gov/pictures/item/2006687066/"" target=""_blank"" rel=""noreferrer noopener"">Members of the Legislature, State of Mississippi, 1874-1875</a>",,,,,,,,,,,,,,,,,,,,,,,,,,,,,,,,,,,,,,,,,,,,,,,,,,,,,,,"legislators,peal",https://msstate-exhibits.libraryhost.com/files/original/bcade939735fa19faa1c3c6ce2a2fd7f.png,"Still Image","Against All Odds: The First Black Legislators in Mississippi ",1,0
"Anderson Boyd",,,,,,"Von Seutter, E.",,1874,,,,,,,,,"<a href=""http://msstate-exhibits.libraryhost.com/exhibits/show/legislators/anderson-boyd--oktibbeha-count"">Boyd, Anderson, active 1874-1875</a>",,,,,,,,,,,,,,,,,,,,,,,,"<a href=""http://www.loc.gov/pictures/item/2006687066/"" target=""_blank"" rel=""noreferrer noopener"">Members of the Legislature, State of Mississippi, 1874-1875</a>",,,,,,,,,,,,,,,,,,,,,,,,,,,,,,,,,,,,,,,,,,,,,,,,,,,,,,,"a boyd,legislators",https://msstate-exhibits.libraryhost.com/files/original/57f61a2dcfcd7f9a1eafcc949b0f6982.png,"Still Image","Against All Odds: The First Black Legislators in Mississippi ",1,0
"Benjamin Chiles",,,,,,"Von Seutter, E.",,1874,,,,,,,,,"<a href=""http://msstate-exhibits.libraryhost.com/exhibits/show/legislators/benjamin-chiles--oktibbeha-cou""><span style=""font-weight:400;"">Chiles, Benjamin, 1825-1911</span></a>",,,,,,,,,,,,,,,,,,,,,,,,"<a href=""http://www.loc.gov/pictures/item/2006687066/"" target=""_blank"" rel=""noreferrer noopener"">Members of the Legislature, State of Mississippi, 1874-1875</a>",,,,,,,,,,,,,,,,,,,,,,,,,,,,,,,,,,,,,,,,,,,,,,,,,,,,,,,"chiles,legislators",https://msstate-exhibits.libraryhost.com/files/original/ef8d85ee39ffa70586ca36aa94294f4f.png,"Still Image","Against All Odds: The First Black Legislators in Mississippi ",1,0
"C. P. Clemens",,,,,,"Von Seutter, E.",,1874,,,,,,,,,"<a href=""http://msstate-exhibits.libraryhost.com/exhibits/show/legislators/c--p--clemens--clarke-county-""><span style=""font-weight:400;"">Clemens, Charles P., -1895</span></a>",,,,,,,,,,,,,,,,,,,,,,,,"<a href=""http://www.loc.gov/pictures/item/2006687066/"" target=""_blank"" rel=""noreferrer noopener"">Members of the Legislature, State of Mississippi, 1874-1875</a>",,,,,,,,,,,,,,,,,,,,,,,,,,,,,,,,,,,,,,,,,,,,,,,,,,,,,,,"clemens,legislators",https://msstate-exhibits.libraryhost.com/files/original/1fa0b6f43e0c76be75f2d0ad312f4a5b.png,"Still Image","Against All Odds: The First Black Legislators in Mississippi ",1,0
