﻿"Dublin Core:Title","Dublin Core:Alternative Title","Dublin Core:Description","Dublin Core:Abstract","Dublin Core:Table Of Contents","Dublin Core:Bibliographic Citation","Dublin Core:Creator","Dublin Core:Contributor","Dublin Core:Date","Dublin Core:Date Created","Dublin Core:Date Available","Dublin Core:Date Accepted","Dublin Core:Date Copyrighted","Dublin Core:Date Submitted","Dublin Core:Date Modified","Dublin Core:Date Valid","Dublin Core:Date Issued","Dublin Core:Subject","Dublin Core:Coverage","Dublin Core:Spatial Coverage","Dublin Core:Temporal Coverage","Dublin Core:Language","Dublin Core:Type","Dublin Core:Format","Dublin Core:Extent","Dublin Core:Medium","Dublin Core:Identifier","Dublin Core:Relation","Dublin Core:Has Part","Dublin Core:Is Part Of","Dublin Core:Has Version","Dublin Core:Is Version Of","Dublin Core:Replaces","Dublin Core:Is Replaced By","Dublin Core:References","Dublin Core:Is Referenced By","Dublin Core:Has Format","Dublin Core:Is Format Of","Dublin Core:Requires","Dublin Core:Is Required By","Dublin Core:Conforms To","Dublin Core:Source","Dublin Core:Provenance","Dublin Core:Rights","Dublin Core:Rights Holder","Dublin Core:Access Rights","Dublin Core:License","Dublin Core:Publisher","Dublin Core:Accrual Method","Dublin Core:Accrual Periodicity","Dublin Core:Accrual Policy","Dublin Core:Audience","Dublin Core:Audience Education Level","Dublin Core:Mediator","Dublin Core:Instructional Method","Item Type Metadata:Text","Item Type Metadata:Interviewer","Item Type Metadata:Interviewee","Item Type Metadata:Location","Item Type Metadata:Transcription","Item Type Metadata:Local URL","Item Type Metadata:Original Format","Item Type Metadata:Physical Dimensions","Item Type Metadata:Duration","Item Type Metadata:Compression","Item Type Metadata:Producer","Item Type Metadata:Director","Item Type Metadata:Bit Rate/Frequency","Item Type Metadata:Time Summary","Item Type Metadata:Email Body","Item Type Metadata:Subject Line","Item Type Metadata:From","Item Type Metadata:To","Item Type Metadata:CC","Item Type Metadata:BCC","Item Type Metadata:Number of Attachments","Item Type Metadata:Standards","Item Type Metadata:Objectives","Item Type Metadata:Materials","Item Type Metadata:Lesson Plan Text","Item Type Metadata:URL","Item Type Metadata:Event Type","Item Type Metadata:Participants","Item Type Metadata:Birth Date","Item Type Metadata:Birthplace","Item Type Metadata:Death Date","Item Type Metadata:Occupation","Item Type Metadata:Biographical Text","Item Type Metadata:Bibliography","Item Type Metadata:Episode","Item Type Metadata:Season","Item Type Metadata:Episode Type","Item Type Metadata:Explicit","Item Type Metadata:Block","PDF Text:Text",Scripto:Transcription,tags,file,itemType,collection,public,featured
"Charles ""LaLa"" Evans",,"Charles ""LaLa"" Evans speaking at the ""Tea Time Reflections: Fannie Lou Hamer and the Voting Struggle"" event held by the Oktibbeha NAACP at Starkville's J. L. King Center.",,,,"Baldwin, DeeDee",,2022-10-15,,,,,,,,,"Hamer, Fannie Lou; National Association for the Advancement of Colored People. Oktibbeha Branch; Starkville (Miss.)",,,,,,,,,,,,,,,,,,,,,,,,,,,,,,,,,,,,,,,,,,,,,,,,,,,,,,,,,,,,,,,,,,,,,,,,,,,,,,,hamer,https://msstate-exhibits.libraryhost.com/files/original/16/1984/20221015_175529.jpg,"Still Image","A Celebration of Fannie Lou Hamer ",1,0
"Cherraye Oats",,"Cherraye Oats, niece of Fannie Lou Hamer, speaking at the ""Tea Time Reflections: Fannie Lou Hamer and the Voting Struggle"" event held by the Oktibbeha NAACP at Starkville's J. L. King Center.",,,,"Baldwin, DeeDee",,2022-10-15,,,,,,,,,"Hamer, Fannie Lou; National Association for the Advancement of Colored People. Oktibbeha Branch; Starkville (Miss.)",,,,,,,,,,,,,,,,,,,,,,,,,,,,,,,,,,,,,,,,,,,,,,,,,,,,,,,,,,,,,,,,,,,,,,,,,,,,,,,hamer,https://msstate-exhibits.libraryhost.com/files/original/16/1983/20221015_174901.jpg,"Still Image","A Celebration of Fannie Lou Hamer ",1,0
"Myron Barnes",,"Singer Myron Barnes performing at the ""Tea Time Reflections: Fannie Lou Hamer and the Voting Struggle"" event held by the Oktibbeha NAACP at Starkville's J. L. King Center.",,,,"Baldwin, DeeDee",,2022-10-15,,,,,,,,,"Hamer, Fannie Lou; National Association for the Advancement of Colored People. Oktibbeha Branch; Starkville (Miss.)",,,,,,,,,,,,,,,,,,,,,,,,,,,,,,,,,,,,,,,,,,,,,,,,,,,,,,,,,,,,,,,,,,,,,,,,,,,,,,,hamer,https://msstate-exhibits.libraryhost.com/files/original/16/1982/20221015_173135.jpg,"Still Image","A Celebration of Fannie Lou Hamer ",1,0
"Lynn Spruill",,"Starkville mayor Lynn Spruill speaking at the ""Tea Time Reflections: Fannie Lou Hamer and the Voting Struggle"" event held by the Oktibbeha NAACP at the J. L. King Center.",,,,"Baldwin, DeeDee",,2022-10-15,,,,,,,,,"Hamer, Fannie Lou; National Association for the Advancement of Colored People. Oktibbeha Branch; Starkville (Miss.); Spruill, Lynn",,,,,,,,,,,,,,,,,,,,,,,,,,,,,,,,,,,,,,,,,,,,,,,,,,,,,,,,,,,,,,,,,,,,,,,,,,,,,,,hamer,https://msstate-exhibits.libraryhost.com/files/original/16/1981/20221015_172717.jpg,"Still Image","A Celebration of Fannie Lou Hamer ",1,0
"Cheik Taylor",,"State Representative Cheik Taylor speaking at the ""Tea Time Reflections: Fannie Lou Hamer and the Voting Struggle"" event held by the Oktibbeha NAACP at Starkville's J. L. King Center.",,,,"Baldwin, DeeDee",,2022-10-15,,,,,,,,,"Hamer, Fannie Lou; National Association for the Advancement of Colored People. Oktibbeha Branch; Starkville (Miss.); Taylor, Cheik",,,,,,,,,,,,,,,,,,,,,,,,,,,,,,,,,,,,,,,,,,,,,,,,,,,,,,,,,,,,,,,,,,,,,,,,,,,,,,,hamer,https://msstate-exhibits.libraryhost.com/files/original/16/1980/20221015_172441.jpg,"Still Image","A Celebration of Fannie Lou Hamer ",1,0
"Diamond Young",,"Diamond Young serving as Mistress of Ceremonies at the ""Tea Time Reflections: Fannie Lou Hamer and the Voting Struggle"" event held by the Oktibbeha NAACP at Starkville's J. L. King Center.",,,,"Baldwin, DeeDee",,2022-10-15,,,,,,,,,"Hamer, Fannie Lou; National Association for the Advancement of Colored People. Oktibbeha Branch; Starkville (Miss.)",,,,,,,,,,,,,,,,,,,,,,,,,,,,,,,,,,,,,,,,,,,,,,,,,,,,,,,,,,,,,,,,,,,,,,,,,,,,,,,hamer,https://msstate-exhibits.libraryhost.com/files/original/16/1979/20221015_172124.jpg,"Still Image","A Celebration of Fannie Lou Hamer ",1,0
"Yulanda Haddix and Cathy Rodriguez",,"Oktibbeha NAACP chair Yulanda Haddix and assistant chair Cathy Rodriguez at ""Tea Time Reflections: A Celebration of Fannie Lou Hamer and the Voting Struggle,"" an event held at Starkville's J. L. King Center.",,,,"Baldwin, DeeDee",,2022-10-15,,,,,,,,,"Hamer, Fannie Lou; National Association for the Advancement of Colored People. Oktibbeha Branch; Starkville (Miss.)",,,,,,,,,,,,,,,,,,,,,,,,,,,,,,,,,,,,,,,,,,,,,,,,,,,,,,,,,,,,,,,,,,,,,,,,,,,,,,,hamer,https://msstate-exhibits.libraryhost.com/files/original/16/1978/IMG_2397.jpg,"Still Image","A Celebration of Fannie Lou Hamer ",1,0
"Cherraye Oats and Cathy Rodriguez",,"Cherraye Oats, a niece of Fannie Lou Hamer, with Oktibbeha County NAACP assistant chair Cathy Rodriguez and Oats' daughter at a table for the Dignity in Schools Campaign.",,,,"Baldwin, DeeDee",,2022-10-15,,,,,,,,,"Hamer, Fannie Lou",,,,,,,,,,,,,,,,,,,,,,,,,,,,,,,,,,,,,,,,,,,,,,,,,,,,,,,,,,,,,,,,,,,,,,,,,,,,,,,hamer,https://msstate-exhibits.libraryhost.com/files/original/16/1977/20221015_171035.jpg,"Still Image","A Celebration of Fannie Lou Hamer ",1,0
"Fannie Lou Hamer Exhibit",,"History librarian DeeDee Baldwin with document reproductions and books on display at the ""Tea Time Reflections: A Celebration of Fannie Lou Hamer and the Voting Struggle"" event.",,,,,,2022-10-15,,,,,,,,,"Hamer, Fannie Lou",,,,,,,,,,,,,,,,,,,,,,,,,,,,,,,,,,,,,,,,,,,,,,,,,,,,,,,,,,,,,,,,,,,,,,,,,,,,,,,hamer,https://msstate-exhibits.libraryhost.com/files/original/16/1976/20221015_165637.jpg,"Still Image","A Celebration of Fannie Lou Hamer ",1,0
"Flier for Oktibbeha NAACP Event",,"Flier created for the Oktibbeha County NAACP's ""Tea Time Reflection: A Celebration of Fannie Lou Hamer and the Voting Struggle.""",,,,"Oktibbeha County NAACP",,2022,,,,,,,,,"Hamer, Fannie Lou",,,,,,,,,,,,,,,,,,,,,,,,,,,,,,,,,,,,,,,,,,,,,,,,,,,,,,,,,,,,,,,,,,,,,,,,,,,,,,,,https://msstate-exhibits.libraryhost.com/files/original/16/1975/image001.jpg,"Still Image","A Celebration of Fannie Lou Hamer ",1,0
